BDBM50515034 CHEMBL4456484
SMILES Brc1nn(C2CCCCO2)c2ncccc12
InChI Key InChIKey=SWWVASLRSRLYJD-UHFFFAOYSA-N
Data  1 KI
  Tab Delimited (TSV)   2D SDfile   Computed 3D by Vconf -m prep SDfile
Find this compound or compounds like it in BindingDB:
Activity Spreadsheet -- Enzyme Inhibition Constant Data from BindingDB
Found 1 hit for monomerid = 50515034
TargetOxysterols receptor LXR-beta(Homo sapiens (Human))
Sun Yat-Sen University
Curated by ChEMBL
LigandPNGBDBM50515034(CHEMBL4456484)
Affinity DataKi:  2.09E+5nM. Assay description: Binding affinity to recombinant human LXRbeta-LBD expressed in Escherichia coli BL21 (DE3) assessed as inhibitory constant incubated for 30 mins by f...
In DepthDetails ArticlePubMed