BDBM50515035 CHEMBL4558077
SMILES CC(C)(C)OC(=O)N1CC2CC(CO)CC2C1
InChI Key InChIKey=XRNJMGKDWQLIJX-UHFFFAOYSA-N
Data  1 KI
  Tab Delimited (TSV)   2D SDfile   Computed 3D by Vconf -m prep SDfile
Find this compound or compounds like it in BindingDB:
Activity Spreadsheet -- Enzyme Inhibition Constant Data from BindingDB
Found 1 hit for monomerid = 50515035
TargetOxysterols receptor LXR-beta(Homo sapiens (Human))
Sun Yat-Sen University
Curated by ChEMBL
LigandPNGBDBM50515035(CHEMBL4558077)
Affinity DataKi:  3.50E+4nM. Assay description: Binding affinity to recombinant human LXRbeta-LBD expressed in Escherichia coli BL21 (DE3) assessed as inhibitory constant incubated for 30 mins by f...
In DepthDetails ArticlePubMed