BDBM50515185 CHEMBL4585225
SMILES NCCCNCCCCNCCCNC(=O)[C@H](Cc1ccc(O)cc1)NC(=O)C1CCCC1
InChI Key InChIKey=QYFZGNQKVGYCKF-QHCPKHFHSA-N
Data  2 IC50
  Tab Delimited (TSV)   2D SDfile   Computed 3D by Vconf -m prep SDfile
Find this compound or compounds like it in BindingDB:
Activity Spreadsheet -- Enzyme Inhibition Constant Data from BindingDB
Found 2 hits for monomerid = 50515185
TargetNeuronal acetylcholine receptor subunit alpha-4/beta-2(Homo sapiens (Human))
University Of Nottingham
Curated by ChEMBL
LigandPNGBDBM50515185(CHEMBL4585225)
Affinity DataIC50:  23nM. Assay description: Antagonist activity at alpha4beta2 nAChR (unknown origin) expressed in Xenopus laevis oocytes assessed as inhibition of Ach-induced channel activatio...
Ligand InfoPC cidPC sid
In DepthDetails ArticlePubMed
TargetNeuronal acetylcholine receptor subunit alpha-3/beta-4(Homo sapiens (Human))
University Of Nottingham
Curated by ChEMBL
LigandPNGBDBM50515185(CHEMBL4585225)
Affinity DataIC50:  0.570nM. Assay description: Antagonist activity at alpha3beta4 nAChR (unknown origin) expressed in Xenopus laevis oocytes assessed as inhibition of Ach-induced channel activatio...
Ligand InfoPC cidPC sid
In DepthDetails ArticlePubMed