BDBM50515465 CHEMBL4536715
SMILES Oc1ccc(\C=N\c2c3CCCCc3nc3ccccc23)cc1O
InChI Key InChIKey=PQHHHZGJZDSJDP-CIAFOILYSA-N
Data  4 KI  2 IC50
  Tab Delimited (TSV)   2D SDfile   Computed 3D by Vconf -m prep SDfile
Find this compound or compounds like it in BindingDB:
Activity Spreadsheet -- Enzyme Inhibition Constant Data from BindingDB
Found 6 hits for monomerid = 50515465
TargetCholinesterase(Equus caballus (Horse))
Universidad De Sevilla
Curated by ChEMBL
LigandPNGBDBM50515465(CHEMBL4536715)
Affinity DataKi:  1.90nM. Assay description: Inhibition of equine serum BuChE assessed as dissociation constant for enzyme-substrate-inhibitor complex using butyrylthiocholine iodide as substrat...
Ligand InfoPC cidPC sid
In DepthDetails ArticlePubMed
TargetCholinesterase(Equus caballus (Horse))
Universidad De Sevilla
Curated by ChEMBL
LigandPNGBDBM50515465(CHEMBL4536715)
Affinity DataKi:  11nM. Assay description: Inhibition of equine serum BuChE assessed as dissociation constant for enzyme-inhibitor complex using butyrylthiocholine iodide as substrate measured...
Ligand InfoPC cidPC sid
In DepthDetails ArticlePubMed
TargetAcetylcholinesterase(Electrophorus electricus (Electric eel))
Universidad De Sevilla
Curated by ChEMBL
LigandPNGBDBM50515465(CHEMBL4536715)
Affinity DataKi:  820nM. Assay description: Inhibition of electric eel AChE assessed as dissociation constant for enzyme-substrate-inhibitor complex using acetylthiocholine iodide as substrate ...
Ligand InfoPC cidPC sid
In DepthDetails ArticlePubMed
TargetAcetylcholinesterase(Electrophorus electricus (Electric eel))
Universidad De Sevilla
Curated by ChEMBL
LigandPNGBDBM50515465(CHEMBL4536715)
Affinity DataKi:  2.10E+3nM. Assay description: Inhibition of electric eel AChE assessed as dissociation constant for enzyme-inhibitor complex using acetylthiocholine iodide as substrate measured f...
Ligand InfoPC cidPC sid
In DepthDetails ArticlePubMed
TargetCholinesterase(Homo sapiens (Human))
Universidad De Sevilla
Curated by ChEMBL
LigandPNGBDBM50515465(CHEMBL4536715)
Affinity DataIC50:  42nM. Assay description: Inhibition of human serum BuChe by Ellman's method
Ligand InfoPC cidPC sid
In DepthDetails ArticlePubMed
TargetAcetylcholinesterase(Homo sapiens (Human))
Universidad De Sevilla
Curated by ChEMBL
LigandPNGBDBM50515465(CHEMBL4536715)
Affinity DataIC50:  609nM. Assay description: Inhibition of human recombinant AChE expressed in HEK293 cells using acetylcholine iodide as substrate preincubated with enzyme for 20 mins followed ...
Ligand InfoPC cidPC sid
In DepthDetails ArticlePubMed