BDBM50515468 CHEMBL4483710
SMILES Oc1ccc(CNc2c3CCCCc3nc3ccccc23)cc1
InChI Key InChIKey=LLBRADQTDMRJOG-UHFFFAOYSA-N
Data  4 KI
  Tab Delimited (TSV)   2D SDfile   Computed 3D by Vconf -m prep SDfile
Find this compound or compounds like it in BindingDB:
Activity Spreadsheet -- Enzyme Inhibition Constant Data from BindingDB
Found 4 hits for monomerid = 50515468
TargetCholinesterase(Equus caballus (Horse))
Universidad De Sevilla
Curated by ChEMBL
LigandPNGBDBM50515468(CHEMBL4483710)
Affinity DataKi:  3.20nM. Assay description: Inhibition of equine serum BuChE assessed as dissociation constant for enzyme-substrate-inhibitor complex using butyrylthiocholine iodide as substrat...
Ligand InfoPC cidPC sid
In DepthDetails ArticlePubMed
TargetCholinesterase(Equus caballus (Horse))
Universidad De Sevilla
Curated by ChEMBL
LigandPNGBDBM50515468(CHEMBL4483710)
Affinity DataKi:  12nM. Assay description: Inhibition of equine serum BuChE assessed as dissociation constant for enzyme-inhibitor complex using butyrylthiocholine iodide as substrate measured...
Ligand InfoPC cidPC sid
In DepthDetails ArticlePubMed
TargetAcetylcholinesterase(Electrophorus electricus (Electric eel))
Universidad De Sevilla
Curated by ChEMBL
LigandPNGBDBM50515468(CHEMBL4483710)
Affinity DataKi:  81nM. Assay description: Inhibition of electric eel AChE assessed as dissociation constant for enzyme-substrate-inhibitor complex using acetylthiocholine iodide as substrate ...
Ligand InfoPC cidPC sid
In DepthDetails ArticlePubMed
TargetAcetylcholinesterase(Electrophorus electricus (Electric eel))
Universidad De Sevilla
Curated by ChEMBL
LigandPNGBDBM50515468(CHEMBL4483710)
Affinity DataKi:  370nM. Assay description: Inhibition of electric eel AChE assessed as dissociation constant for enzyme-inhibitor complex using acetylthiocholine iodide as substrate measured f...
Ligand InfoPC cidPC sid
In DepthDetails ArticlePubMed