BDBM50515477 CHEMBL4538561
SMILES OC(=O)c1cc(NC(=O)c2cnccn2)cc(c1)-c1ccc(cc1)C1CCNCC1
InChI Key InChIKey=FSXSJQSLCYEKDE-UHFFFAOYSA-N
Data  1 IC50
  Tab Delimited (TSV)   2D SDfile   Computed 3D by Vconf -m prep SDfile
Find this compound or compounds like it in BindingDB:
Activity Spreadsheet -- Enzyme Inhibition Constant Data from BindingDB
Found 1 hit for monomerid = 50515477
TargetP2Y purinoceptor 14(Homo sapiens (Human))
China Pharmaceutical University
Curated by ChEMBL
LigandPNGBDBM50515477(CHEMBL4538561)
Affinity DataIC50:  4.40nM. Assay description: Antagonist activity at human P2Y14R stably expressed in human forskolin treated THP1 cells assessed as reduction in P2Y14R agonist UDPG-induced inhib...
Ligand InfoPC cidPC sid
In DepthDetails ArticlePubMed