BDBM50515726 CHEMBL4462405
SMILES CCCCCCCCCCCCCCCCCCOC(c1cccc2ccccc12)P(O)(O)=O
InChI Key InChIKey=IIAOXWLLPSQBBO-UHFFFAOYSA-N
Data  1 KI
PDB links: 1 PDB ID matches this monomer.
  Tab Delimited (TSV)   2D SDfile   Computed 3D by Vconf -m prep SDfile
Find this compound or compounds like it in BindingDB:
Activity Spreadsheet -- Enzyme Inhibition Constant Data from BindingDB
Found 1 hit for monomerid = 50515726
TargetFe(3+)-Zn(2+) purple acid phosphatase(Phaseolus vulgaris)
The University Of Queensland
Curated by ChEMBL
LigandPNGBDBM50515726(CHEMBL4462405)
Affinity DataKi:  500nM. Assay description: Competitive inhibition of red kidney bean PAP using varying levels of pNPP as substrate measured at pH 6.2 by UV-vis spectrophotometric analysis
Ligand InfoPC cidPC sidPDB