BDBM50516782 CHEMBL4592199
SMILES CCCCCn1c2ccccc2s\c1=N/C(=O)c1cccc(c1)C(F)(F)F
InChI Key InChIKey=CJYYPZJJGLDCDK-CLCOLTQESA-N
Data  2 KI  5 EC50
  Tab Delimited (TSV)   2D SDfile   Computed 3D by Vconf -m prep SDfile
Find this compound or compounds like it in BindingDB:
Activity Spreadsheet -- Enzyme Inhibition Constant Data from BindingDB
Found 7 hits for monomerid = 50516782
TargetCannabinoid receptor 1(Homo sapiens (Human))
German University In Cairo
Curated by ChEMBL
LigandPNGBDBM50516782(CHEMBL4592199)
Affinity DataKi:  1nM. Assay description: Displacement of [3H]CP55940 from recombinant human CB1R expressed in HEK293 cell membranes incubated for 90 mins by Cheng-Prusoff equation analysis
Ligand InfoPC cidPC sid
In DepthDetails ArticlePubMed
TargetCannabinoid receptor 2(Homo sapiens (Human))
German University In Cairo
Curated by ChEMBL
LigandPNGBDBM50516782(CHEMBL4592199)
Affinity DataKi:  460nM. Assay description: Displacement of [3H]CP55940 from recombinant human CB2R expressed in HEK293 cell membranes incubated for 90 mins by Cheng-Prusoff equation analysis
Ligand InfoPC cidPC sid
In DepthDetails ArticlePubMed
TargetCannabinoid receptor 1(Homo sapiens (Human))
German University In Cairo
Curated by ChEMBL
LigandPNGBDBM50516782(CHEMBL4592199)
Affinity DataEC50: >3.00E+4nM. Assay description: Agonist activity at N-terminal Flag epitope tagged CB1 (unknown origin) expressed in HTLA cells assessed as increase of beta-arrestin recruitment by ...
Ligand InfoPC cidPC sid
In DepthDetails ArticlePubMed
TargetCannabinoid receptor 2(Homo sapiens (Human))
German University In Cairo
Curated by ChEMBL
LigandPNGBDBM50516782(CHEMBL4592199)
Affinity DataEC50:  306nM. Assay description: Agonist activity at recombinant human CB2R expressed in CHOK1 cells assessed as inhibition of NKH477-stimulated intracellular cAMP levels after 30 mi...
Ligand InfoPC cidPC sid
In DepthDetails ArticlePubMed
TargetCannabinoid receptor 2(Homo sapiens (Human))
German University In Cairo
Curated by ChEMBL
LigandPNGBDBM50516782(CHEMBL4592199)
Affinity DataEC50: >3.00E+4nM. Assay description: Antagonist activity at N-terminal Flag epitope tagged CB2 (unknown origin) expressed in HTLA cells assessed as decrease in CP55940-induced beta-arres...
Ligand InfoPC cidPC sid
In DepthDetails ArticlePubMed
TargetCannabinoid receptor 2(Homo sapiens (Human))
German University In Cairo
Curated by ChEMBL
LigandPNGBDBM50516782(CHEMBL4592199)
Affinity DataEC50:  129nM. Assay description: Agonist activity at N-terminal Flag epitope tagged CB2 (unknown origin) expressed in HTLA cells assessed as increase of beta-arrestin recruitment by ...
Ligand InfoPC cidPC sid
In DepthDetails ArticlePubMed
TargetCannabinoid receptor 1(Homo sapiens (Human))
German University In Cairo
Curated by ChEMBL
LigandPNGBDBM50516782(CHEMBL4592199)
Affinity DataEC50: >3.00E+4nM. Assay description: Antagonist activity at N-terminal Flag epitope tagged CB1 (unknown origin) expressed in HTLA cells assessed as decrease in CP55940-induced beta-arres...
Ligand InfoPC cidPC sid
In DepthDetails ArticlePubMed