BDBM50517072 CHEMBL4450922
SMILES [O-][N+](=O)CC(c1c([nH]c2ccccc12)-c1ccccc1)c1ccccc1
InChI Key InChIKey=OHZDCJJHWPHZJD-UHFFFAOYSA-N
Data  3 KI  19 EC50
  Tab Delimited (TSV)   2D SDfile   Computed 3D by Vconf -m prep SDfile
Find this compound or compounds like it in BindingDB:
Activity Spreadsheet -- Enzyme Inhibition Constant Data from BindingDB
Found 22 hits for monomerid = 50517072
TargetCannabinoid receptor 1(Homo sapiens (Human))
Northeastern University
Curated by ChEMBL
LigandPNGBDBM50517072(CHEMBL4450922)
Affinity DataKi:  110nM. Assay description: Displacement of [3H]CP55940 from human CB1 receptor expressed in CHO-K1 cell membranes incubated for 60 mins by liquid scintillation spectrometry ana...
In DepthDetails ArticlePubMed
TargetCannabinoid receptor 1(Homo sapiens (Human))
Northeastern University
Curated by ChEMBL
LigandPNGBDBM50517072(CHEMBL4450922)
Affinity DataKi:  120nM. Assay description: Displacement of [3H]CP55940 from human CB1R receptor expressed in CHO cell membranes after 60 mins by liquid scintillation spectrometry analysis
In DepthDetails ArticlePubMed
TargetCannabinoid receptor 1(Homo sapiens (Human))
Northeastern University
Curated by ChEMBL
LigandPNGBDBM50517072(CHEMBL4450922)
Affinity DataKi:  160nM. Assay description: Displacement of [3H]SR141716A from human CB1R receptor expressed in CHO cell membranes after 2 hrs by liquid scintillation spectrometry analysis
In DepthDetails ArticlePubMed
TargetCannabinoid receptor 1(Homo sapiens (Human))
Northeastern University
Curated by ChEMBL
LigandPNGBDBM50517072(CHEMBL4450922)
Affinity DataEC50:  940nM. Assay description: Positive allosteric modulatory activity at human CB1R expressed in CHO-K1 cells assessed as increase in CP55940-induced beta-arrestin2 recruitment af...
In DepthDetails ArticlePubMed
TargetCannabinoid receptor 1(Homo sapiens (Human))
Northeastern University
Curated by ChEMBL
LigandPNGBDBM50517072(CHEMBL4450922)
Affinity DataEC50:  230nM. Assay description: Positive allosteric modulatory activity at human CB1R expressed in CHO-K1 cells assessed as increase in CP55940-induced inhibition of forskolin-stimu...
In DepthDetails ArticlePubMed
TargetCannabinoid receptor 1(Rattus norvegicus (rat))
Northeastern University
Curated by ChEMBL
LigandPNGBDBM50517072(CHEMBL4450922)
Affinity DataEC50:  240nM. Assay description: Allosteric agonist activity at N-terminal GFP-tagged rat CB1R expressed in HEK293 cells assessed as inhibition of forskolin-induced cAMP production a...
In DepthDetails ArticlePubMed
TargetCannabinoid receptor 1(Homo sapiens (Human))
Northeastern University
Curated by ChEMBL
LigandPNGBDBM50517072(CHEMBL4450922)
Affinity DataEC50:  8.10nM. Assay description: Positive allosteric modulatory activity at human CB1R expressed in CHO-K1 cells assessed as increase in CP55940-induced inhibition of forskolin-induc...
In DepthDetails ArticlePubMed
TargetCannabinoid receptor 1(Homo sapiens (Human))
Northeastern University
Curated by ChEMBL
LigandPNGBDBM50517072(CHEMBL4450922)
Affinity DataEC50:  200nM. Assay description: Positive allosteric modulatory activity at human CB1R expressed in CHO-K1 cells assessed as increase in CP55940-induced beta arrestin2 recruitment af...
In DepthDetails ArticlePubMed
TargetCannabinoid receptor 1(Homo sapiens (Human))
Northeastern University
Curated by ChEMBL
LigandPNGBDBM50517072(CHEMBL4450922)
Affinity DataEC50:  78nM. Assay description: Allosteric agonist activity at human CB1R expressed in CHO-K1 cells assessed as inhibition of forskolin-induced cAMP accumulation after 90 mins by hi...
In DepthDetails ArticlePubMed
TargetCannabinoid receptor 1(Rattus norvegicus (rat))
Northeastern University
Curated by ChEMBL
LigandPNGBDBM50517072(CHEMBL4450922)
Affinity DataEC50:  17nM. Assay description: Positive allosteric modulatory activity at N-terminal GFP-tagged rat CB1R receptor expressed in HEK293 cells assessed as CP55940 EC50 for inhibition ...
In DepthDetails ArticlePubMed
TargetCannabinoid receptor 1(Rattus norvegicus (rat))
Northeastern University
Curated by ChEMBL
LigandPNGBDBM50517072(CHEMBL4450922)
Affinity DataEC50:  17nM. Assay description: Positive allosteric modulatory activity at N-terminal GFP-tagged rat CB1R receptor expressed in HEK293 cells assessed as CP55940 EC50 for inhibition ...
In DepthDetails ArticlePubMed
TargetCannabinoid receptor 1(Rattus norvegicus (rat))
Northeastern University
Curated by ChEMBL
LigandPNGBDBM50517072(CHEMBL4450922)
Affinity DataEC50:  17nM. Assay description: Positive allosteric modulatory activity at N-terminal GFP-tagged rat CB1R receptor expressed in HEK293 cells assessed as CP55940 EC50 for inhibition ...
In DepthDetails ArticlePubMed
TargetCannabinoid receptor 1(Homo sapiens (Human))
Northeastern University
Curated by ChEMBL
LigandPNGBDBM50517072(CHEMBL4450922)
Affinity DataEC50:  72nM. Assay description: Agonist activity at human CB1 receptor expressed in CHO cell membranes assessed as increase in G-protein coupling by measuring [35S]GTPgammaS binding...
In DepthDetails ArticlePubMed
TargetCannabinoid receptor 1(Homo sapiens (Human))
Northeastern University
Curated by ChEMBL
LigandPNGBDBM50517072(CHEMBL4450922)
Affinity DataEC50:  1.20E+3nM. Assay description: Allosteric agonist activity at human CB1R expressed in CHO-K1 cells assessed as increase in beta arrestin2 recruitment after 90 mins by pathhunter be...
In DepthDetails ArticlePubMed
TargetCannabinoid receptor 1(Homo sapiens (Human))
Northeastern University
Curated by ChEMBL
LigandPNGBDBM50517072(CHEMBL4450922)
Affinity DataEC50:  629nM. Assay description: Positive allosteric modulatory activity at human CB1 receptor expressed in CHO-K1 cells assessed as increase in CP55940-induced beta-arrestin recruit...
In DepthDetails ArticlePubMed
TargetCannabinoid receptor 1(Homo sapiens (Human))
Northeastern University
Curated by ChEMBL
LigandPNGBDBM50517072(CHEMBL4450922)
Affinity DataEC50:  303nM. Assay description: Positive allosteric modulatory activity at human CB1 receptor expressed in CHO-K1 cells assessed as increase in CP55940-induced inhibition of forskol...
In DepthDetails ArticlePubMed
TargetCannabinoid receptor 1(Homo sapiens (Human))
Northeastern University
Curated by ChEMBL
LigandPNGBDBM50517072(CHEMBL4450922)
Affinity DataEC50:  260nM. Assay description: Positive allosteric modulation of human CB1 receptor expressed in CHO-K1 cells assessed as inhibition of forskolin-induced cAMP production incubated ...
In DepthDetails ArticlePubMed
TargetCannabinoid receptor 1(Homo sapiens (Human))
Northeastern University
Curated by ChEMBL
LigandPNGBDBM50517072(CHEMBL4450922)
Affinity DataEC50:  650nM. Assay description: Positive allosteric modulation of human CB1 receptor expressed in CHO-K1 cells assessed as beta-arrestin 2 recruitment incubated for 90 mins by PathH...
In DepthDetails ArticlePubMed
TargetCannabinoid receptor 1(Rattus norvegicus (rat))
Northeastern University
Curated by ChEMBL
LigandPNGBDBM50517072(CHEMBL4450922)
Affinity DataEC50:  17nM. Assay description: Positive allosteric modulatory activity at N-terminal GFP-tagged rat CB1R receptor expressed in HEK293 cells assessed as CP55940 EC50 for inhibition ...
In DepthDetails ArticlePubMed
TargetCannabinoid receptor 1(Homo sapiens (Human))
Northeastern University
Curated by ChEMBL
LigandPNGBDBM50517072(CHEMBL4450922)
Affinity DataEC50:  72nM. Assay description: Agonist activity at human CB1 receptor expressed in CHO cell membranes assessed as increase in [35S]GTPgammaS binding incubated for 30 mins by liquid...
In DepthDetails ArticlePubMed
TargetCannabinoid receptor 1(Mus musculus (Mouse))
University Of North Carolina At Greensboro
Curated by ChEMBL
LigandPNGBDBM50517072(CHEMBL4450922)
Affinity DataEC50:  940nM. Assay description: Positive allosteric modulatory activity at mouse CB1R expressed in CHO-K1 cells assessed as CP55940-induced beta-arrestin2 recruitment by pathhunter ...
In DepthDetails ArticlePubMed
TargetCannabinoid receptor 1(Homo sapiens (Human))
Northeastern University
Curated by ChEMBL
LigandPNGBDBM50517072(CHEMBL4450922)
Affinity DataEC50:  230nM. Assay description: Positive allosteric modulatory activity at human CB1R expressed in CHO-K1 cells assessed as CP55940-induced cAMP level by hit-hunter cAMP assay
In DepthDetails ArticlePubMed