BDBM50517254 CHEMBL4553617
SMILES COc1ccc2nc(oc(=O)c2c1)C(F)(F)F
InChI Key InChIKey=PQMNUPGUZKLBRB-UHFFFAOYSA-N
Data  1 IC50
  Tab Delimited (TSV)   2D SDfile   Computed 3D by Vconf -m prep SDfile
Find this compound or compounds like it in BindingDB:
Activity Spreadsheet -- Enzyme Inhibition Constant Data from BindingDB
Found 1 hit for monomerid = 50517254
TargetPhosphopantetheine adenylyltransferase(Escherichia coli)
Lavis
Curated by ChEMBL
LigandPNGBDBM50517254(CHEMBL4553617)
Affinity DataIC50: >1.00E+5nM. Assay description: Inhibition of Escherichia coli PPAT after 5 mins by reverse ATP-generating-luciferase assay
Ligand InfoPC cidPC sid
In DepthDetails ArticlePubMed