BDBM50517255 CHEMBL4442395
SMILES Fc1ccc2NC(=O)COc2c1
InChI Key InChIKey=TXRXHEOGQVPEBT-UHFFFAOYSA-N
Data  1 Kd
  Tab Delimited (TSV)   2D SDfile   Computed 3D by Vconf -m prep SDfile
Find this compound or compounds like it in BindingDB:
Activity Spreadsheet -- Enzyme Inhibition Constant Data from BindingDB
Found 1 hit for monomerid = 50517255
TargetCD209 antigen(Homo sapiens (Human))
Lavis
Curated by ChEMBL
LigandPNGBDBM50517255(CHEMBL4442395)
Affinity DataKd:  2.10E+6nM. Assay description: Binding affinity to human DC-SIGN ECD expressed in Escherichia coli BL21(DE3) after 1 hr by Man-Fl-BSA assay
In DepthDetails ArticlePubMed