BDBM50517350 CHEMBL4445353
SMILES CCCC[C@H](NC(=O)[C@H](Cc1c[nH]c2ccccc12)NC(=O)[C@H](CCCCN)NC(=O)[C@H](CCCC)NC(=O)[C@H](Cc1ccc(OS(O)(=O)=O)cc1)NC(=O)[C@H](CC(O)=O)NC(=O)COCCOCCNC(=O)COCCOCCNC(=O)CC[C@H](NC(=O)CCCCCCCCCCCCCCCCC(O)=O)C(O)=O)C(=O)N[C@@H](CC(O)=O)C(=O)N[C@@H](Cc1ccccc1)C(N)=O
InChI Key InChIKey=PBPAPQWHSXBNNN-AMIYENIPSA-N
Data  2 IC50  2 EC50
  Tab Delimited (TSV)   2D SDfile   Computed 3D by Vconf -m prep SDfile
Find this compound or compounds like it in BindingDB:
Activity Spreadsheet -- Enzyme Inhibition Constant Data from BindingDB
Found 4 hits for monomerid = 50517350
TargetCholecystokinin receptor type A(Homo sapiens (Human))
TBA
Curated by ChEMBL
LigandPNGBDBM50517350(CHEMBL4445353)
Affinity DataIC50:  2.57E+3nM. Assay description: Displacement of [125I]-CCK-8 from human CCK1R expressed in human 1321N1 cell membranes after 2 hrs by SPA assay
Ligand InfoKEGGPC cidPC sid
In DepthDetails ArticlePubMed
TargetGastrin/cholecystokinin type B receptor(Homo sapiens (Human))
TBA
Curated by ChEMBL
LigandPNGBDBM50517350(CHEMBL4445353)
Affinity DataEC50:  0.832nM. Assay description: Agonist activity at human CCK2R expressed in human 1321N1 cells assessed as IP1 accumulation after 1 hr by HTRF assay
Ligand InfoKEGGPC cidPC sid
In DepthDetails ArticlePubMed
TargetCholecystokinin receptor type A(Homo sapiens (Human))
TBA
Curated by ChEMBL
LigandPNGBDBM50517350(CHEMBL4445353)
Affinity DataEC50:  912nM. Assay description: Agonist activity at human CCK1R expressed in human 1321N1 cells assessed as IP1 accumulation after 1 hr by HTRF assay
Ligand InfoKEGGPC cidPC sid
In DepthDetails ArticlePubMed
TargetGastrin/cholecystokinin type B receptor(Homo sapiens (Human))
TBA
Curated by ChEMBL
LigandPNGBDBM50517350(CHEMBL4445353)
Affinity DataIC50:  13nM. Assay description: Displacement of [125I]-CCK-8 from human CCK2R expressed in human 1321N1 cell membranes after 2 hrs by SPA assay
Ligand InfoKEGGPC cidPC sid
In DepthDetails ArticlePubMed