BDBM50518711 CHEMBL4443221
SMILES COc1ccc(CNc2nn(C)c3c2sc2nc(C)c(Cl)c(C)c32)cc1
InChI Key InChIKey=XLSXHCSOFOSILP-UHFFFAOYSA-N
Data  1 EC50
  Tab Delimited (TSV)   2D SDfile   Computed 3D by Vconf -m prep SDfile
Find this compound or compounds like it in BindingDB:
Activity Spreadsheet -- Enzyme Inhibition Constant Data from BindingDB
Found 1 hit for monomerid = 50518711
TargetMuscarinic acetylcholine receptor M4(Homo sapiens (Human))
Vanderbilt University
Curated by ChEMBL
LigandPNGBDBM50518711(CHEMBL4443221)
Affinity DataEC50: >1.00E+4nM. Assay description: Positive allosteric modulation of Gqi5-fused human M4 AChR assessed as increase in acetylcholine-induced calcium mobilization
Ligand InfoPC cidPC sid
In DepthDetails ArticlePubMed