BDBM50518952 CHEMBL4476525
SMILES Fc1ccc2ccnc(N3CCN(CCCNc4cc(=O)oc5CCS(=O)(=O)Cc45)CC3)c2c1
InChI Key InChIKey=RLIMKAAJGCMTSO-UHFFFAOYSA-N
Data  4 IC50
  Tab Delimited (TSV)   2D SDfile   Computed 3D by Vconf -m prep SDfile
Find this compound or compounds like it in BindingDB:
Activity Spreadsheet -- Enzyme Inhibition Constant Data from BindingDB
Found 4 hits for monomerid = 50518952
TargetDNA gyrase subunit A(Escherichia coli (strain K12))
Angelini
Curated by ChEMBL
LigandPNGBDBM50518952(CHEMBL4476525)
Affinity DataIC50:  2.90E+3nM. Assay description: Inhibition of Escherichia coli ATCC 25922 DNA gyrase A assessed as reduction in enzyme-mediated supercoiling of relaxed pBR322 DNA by ethidium bromid...
Ligand InfoPC cidPC sid
In DepthDetails ArticlePubMed
TargetDNA topoisomerase 4 subunit A(Staphylococcus aureus)
Angelini
Curated by ChEMBL
LigandPNGBDBM50518952(CHEMBL4476525)
Affinity DataIC50:  2.10E+3nM. Assay description: Inhibition of Staphylococcus aureus ATCC 29213 DNA topoisomerase 4 subunit ParC assessed as reduction in decatenation of kinetoplast DNA incubated fo...
Ligand InfoPC cidPC sid
In DepthDetails ArticlePubMed
TargetDNA gyrase subunit A(Staphylococcus aureus)
Angelini
Curated by ChEMBL
LigandPNGBDBM50518952(CHEMBL4476525)
Affinity DataIC50:  7.80E+3nM. Assay description: Inhibition of Staphylococcus aureus ATCC 29213 DNA gyrase A assessed as reduction in enzyme-mediated supercoiling of relaxed pBR322 DNA by ethidium b...
Ligand InfoPC cidPC sid
In DepthDetails ArticlePubMed
TargetDNA topoisomerase 4 subunit A(Escherichia coli (strain K12))
Angelini
Curated by ChEMBL
LigandPNGBDBM50518952(CHEMBL4476525)
Affinity DataIC50:  5.25E+4nM. Assay description: Inhibition of Escherichia coli ATCC 25922 DNA topoisomerase 4 subunit ParC assessed as reduction in decatenation of kinetoplast DNA incubated for 30 ...
Ligand InfoPC cidPC sid
In DepthDetails ArticlePubMed