BDBM50519233 CHEMBL4533719
SMILES [H][C@@]12OC(=O)C(CCC(=O)\C(C)=C\C[C@H]1C(C)=C)=C2
InChI Key InChIKey=JGVZCSFIQFRWHI-USZOJTKQSA-N
Data  1 IC50
  Tab Delimited (TSV)   2D SDfile   Computed 3D by Vconf -m prep SDfile
Find this compound or compounds like it in BindingDB:
Activity Spreadsheet -- Enzyme Inhibition Constant Data from BindingDB
Found 1 hit for monomerid = 50519233
TargetTGF-beta receptor type-1(Homo sapiens (Human))
Sun Yat-Sen University
Curated by ChEMBL
LigandPNGBDBM50519233(CHEMBL4533719)
Affinity DataIC50:  15nM. Assay description: Inhibition of recombinant human N-terminal GST-tagged TGFbeta1 receptor (80 to end residues) expressed in baculovirus infected Sf9 insect cells using...
Ligand InfoPC cidPC sid
In DepthDetails ArticlePubMed