BDBM50519421 CHEMBL4580861
SMILES OCCn1cc(-c2ccc(F)cc2)c(=O)c2c(Nc3ccc(Oc4ccnc(NC(=O)C5CC5)c4)c(F)c3)nccc12
InChI Key InChIKey=FLKGBIMPITXULB-UHFFFAOYSA-N
Data  2 IC50
  Tab Delimited (TSV)   2D SDfile   Computed 3D by Vconf -m prep SDfile
Find this compound or compounds like it in BindingDB:
Activity Spreadsheet -- Enzyme Inhibition Constant Data from BindingDB
Found 2 hits for monomerid = 50519421
TargetHepatocyte growth factor receptor(Homo sapiens (Human))
Central China Normal University
Curated by ChEMBL
LigandPNGBDBM50519421(CHEMBL4580861)
Affinity DataIC50:  34nM. Assay description: Inhibition of purified recombinant MET kinase domain (unknown origin) using biotin as substrate preincubated for 5 mins followed by substrate additio...
Ligand InfoPC cidPC sid
In DepthDetails ArticlePubMed
TargetVascular endothelial growth factor receptor 2(Homo sapiens (Human))
Central China Normal University
Curated by ChEMBL
LigandPNGBDBM50519421(CHEMBL4580861)
Affinity DataIC50:  1.05E+4nM. Assay description: Inhibition of purified recombinant VEGFR2 kinase domain (unknown origin) using biotin as substrate preincubated for 5 mins followed by substrate addi...
Ligand InfoPC cidPC sid
In DepthDetails ArticlePubMed