BDBM50519426 CHEMBL4530342
SMILES CCCC(=O)Nc1cc(Oc2ccc(Nc3nccc4[nH]cc(-c5ccc(F)cc5)c(=O)c34)cc2F)ccn1
InChI Key InChIKey=WZJWUFBHESGOMB-UHFFFAOYSA-N
Data  2 IC50
  Tab Delimited (TSV)   2D SDfile   Computed 3D by Vconf -m prep SDfile
Find this compound or compounds like it in BindingDB:
Activity Spreadsheet -- Enzyme Inhibition Constant Data from BindingDB
Found 2 hits for monomerid = 50519426
TargetHepatocyte growth factor receptor(Homo sapiens (Human))
Central China Normal University
Curated by ChEMBL
LigandPNGBDBM50519426(CHEMBL4530342)
Affinity DataIC50:  15nM. Assay description: Inhibition of purified recombinant MET kinase domain (unknown origin) using biotin as substrate preincubated for 5 mins followed by substrate additio...
Ligand InfoPC cidPC sid
In DepthDetails ArticlePubMed
TargetVascular endothelial growth factor receptor 2(Homo sapiens (Human))
Central China Normal University
Curated by ChEMBL
LigandPNGBDBM50519426(CHEMBL4530342)
Affinity DataIC50:  19nM. Assay description: Inhibition of purified recombinant VEGFR2 kinase domain (unknown origin) using biotin as substrate preincubated for 5 mins followed by substrate addi...
Ligand InfoPC cidPC sid
In DepthDetails ArticlePubMed