BDBM50519551 CHEMBL4569530
SMILES CN(C)C(=O)c1cc2cnc(Nc3cccc(NC(=O)CCCCCCCN=C=S)c3)nc2n1C1CCCC1
InChI Key InChIKey=YFJULKCXZDASLJ-UHFFFAOYSA-N
Data  1 IC50
  Tab Delimited (TSV)   2D SDfile   Computed 3D by Vconf -m prep SDfile
Find this compound or compounds like it in BindingDB:
Activity Spreadsheet -- Enzyme Inhibition Constant Data from BindingDB
Found 1 hit for monomerid = 50519551
TargetCyclin-T1/Cyclin-dependent kinase 9(Homo sapiens (Human))
Nankai University
Curated by ChEMBL
LigandPNGBDBM50519551(CHEMBL4569530)
Affinity DataIC50:  15nM. Assay description: Inhibition of recombinant full-length human CDK9/cyclinT1 using KTFCGTPEYLAPEVRREPRILSEEEQEMFRDFDYIADWC peptide as substrate measured after 40 mins i...
Ligand InfoPC cidPC sid
In DepthDetails ArticlePubMed