BDBM50519704 CHEMBL4476505
SMILES CCOc1ccc(cc1)C(=O)Nc1cccc(NC(=O)COc2ccc3c(c2)occc3=O)c1
InChI Key InChIKey=ABPSPQITFLVJSN-UHFFFAOYSA-N
Data  2 IC50
  Tab Delimited (TSV)   2D SDfile   Computed 3D by Vconf -m prep SDfile
Find this compound or compounds like it in BindingDB:
Activity Spreadsheet -- Enzyme Inhibition Constant Data from BindingDB
Found 2 hits for monomerid = 50519704
TargetRho-associated protein kinase 1(Homo sapiens (Human))
TBA
Curated by ChEMBL
LigandPNGBDBM50519704(CHEMBL4476505)
Affinity DataIC50:  17nM. Assay description: Inhibition of recombinant human ROCK1 (17 to 535 residues) using KEAKEKRQEQIAKR as substrate incubated for 40 mins in presence of [gamma-33P]ATP and ...
Ligand InfoPC cidPC sid
In DepthDetails ArticlePubMed
TargetRho-associated protein kinase 2(Homo sapiens (Human))
TBA
Curated by ChEMBL
LigandPNGBDBM50519704(CHEMBL4476505)
Affinity DataIC50:  9nM. Assay description: Inhibition of recombinant human ROCK2 (11 to 552 residues) using KEAKEKRQEQIAKR as substrate incubated for 40 mins in presence of [gamma-33P]ATP and ...
Ligand InfoPC cidPC sid
In DepthDetails ArticlePubMed