BDBM50519712 CHEMBL4586795
SMILES O=C(COc1ccc2c(c1)occc2=O)Nc1cccc(NC(=O)c2ccccc2)c1
InChI Key InChIKey=CJTWJAYLKYVKRD-UHFFFAOYSA-N
Data  2 IC50
  Tab Delimited (TSV)   2D SDfile   Computed 3D by Vconf -m prep SDfile
Find this compound or compounds like it in BindingDB:
Activity Spreadsheet -- Enzyme Inhibition Constant Data from BindingDB
Found 2 hits for monomerid = 50519712
TargetRho-associated protein kinase 1(Homo sapiens (Human))
TBA
Curated by ChEMBL
LigandPNGBDBM50519712(CHEMBL4586795)
Affinity DataIC50:  120nM. Assay description: Inhibition of recombinant human ROCK1 (17 to 535 residues) using KEAKEKRQEQIAKR as substrate incubated for 40 mins in presence of [gamma-33P]ATP and ...
Ligand InfoPC cidPC sid
In DepthDetails ArticlePubMed
TargetRho-associated protein kinase 2(Homo sapiens (Human))
TBA
Curated by ChEMBL
LigandPNGBDBM50519712(CHEMBL4586795)
Affinity DataIC50:  16nM. Assay description: Inhibition of recombinant human ROCK2 (11 to 552 residues) using KEAKEKRQEQIAKR as substrate incubated for 40 mins in presence of [gamma-33P]ATP and ...
Ligand InfoPC cidPC sid
In DepthDetails ArticlePubMed