BDBM50519867 CHEMBL4552890
SMILES C(CN1CCCC(C1)c1ccccc1)NC1CCN(Cc2ccccc2)C1
InChI Key InChIKey=CCYAENBYIJKXJM-UHFFFAOYSA-N
Data  1 IC50
  Tab Delimited (TSV)   2D SDfile   Computed 3D by Vconf -m prep SDfile
Find this compound or compounds like it in BindingDB:
Activity Spreadsheet -- Enzyme Inhibition Constant Data from BindingDB
Found 1 hit for monomerid = 50519867
TargetCholinesterase(Equus caballus (Horse))
Jagiellonian University Medical College
Curated by ChEMBL
LigandPNGBDBM50519867(CHEMBL4552890)
Affinity DataIC50:  2.39E+3nM. Assay description: Inhibition of equine serum BuChE using butyrylthiocholine chloride as substrate pre-incubated for 5 mins followed by substrate addition and measured ...
Ligand InfoPC cidPC sid
In DepthDetails ArticlePubMed