BDBM50521232 CHEMBL4567596
SMILES NS(=O)(=O)NCc1nnc(o1)C(c1nc2ccc(cc2s1)-c1cccc(Cl)c1)S(=O)(=O)Cc1ccccc1
InChI Key InChIKey=QTLKEMOUBMXNFP-UHFFFAOYSA-N
Data  4 IC50
  Tab Delimited (TSV)   2D SDfile   Computed 3D by Vconf -m prep SDfile
Find this compound or compounds like it in BindingDB:
Activity Spreadsheet -- Enzyme Inhibition Constant Data from BindingDB
Found 4 hits for monomerid = 50521232
TargetEndothelial lipase(Homo sapiens (Human))
Bristol-Myers Squibb
Curated by ChEMBL
LigandPNGBDBM50521232(CHEMBL4567596)
Affinity DataIC50:  66nM. Assay description: Inhibition of endothelial lipase in human HT1080 cells using PED-A1 containing DMPG vesicles as substrate pretreated for 20 mins followed by substrat...
Ligand InfoPC cidPC sid
In DepthDetails ArticlePubMed
TargetEndothelial lipase(Homo sapiens (Human))
Bristol-Myers Squibb
Curated by ChEMBL
LigandPNGBDBM50521232(CHEMBL4567596)
Affinity DataIC50:  10nM. Assay description: Inhibition of endothelial lipase in human HT1080 cells using PED-A1 containing DMPG vesicles as substrate pretreated for 20 mins followed by substrat...
Ligand InfoPC cidPC sid
In DepthDetails ArticlePubMed
TargetHepatic triacylglycerol lipase(Homo sapiens (Human))
Bristol-Myers Squibb
Curated by ChEMBL
LigandPNGBDBM50521232(CHEMBL4567596)
Affinity DataIC50: <10nM. Assay description: Inhibition of recombinant human HL expressed in COS7 cells using PED-A1 containing DMPG vesicles as substrate pretreated for 20 mins followed by subs...
Ligand InfoPC cidPC sid
In DepthDetails ArticlePubMed
TargetEndothelial lipase(Homo sapiens (Human))
Bristol-Myers Squibb
Curated by ChEMBL
LigandPNGBDBM50521232(CHEMBL4567596)
Affinity DataIC50:  53nM. Assay description: Inhibition of endothelial lipase in human HT1080 cells using PED-A1 containing DMPG vesicles as substrate pretreated for 20 mins followed by substrat...
Ligand InfoPC cidPC sid
In DepthDetails ArticlePubMed