BDBM50521241 CHEMBL4456936
SMILES [H][C@]12CC[C@]([H])(CN(C1)c1cc(C)ncn1)[C@H]2Nc1nc2N(CCCn2n1)c1cc(C)cc(F)c1
InChI Key InChIKey=ZOZWAERYOYZUFG-OPMZPASUSA-N
Data  1 EC50
  Tab Delimited (TSV)   2D SDfile   Computed 3D by Vconf -m prep SDfile
Find this compound or compounds like it in BindingDB:
Activity Spreadsheet -- Enzyme Inhibition Constant Data from BindingDB
Found 1 hit for monomerid = 50521241
TargetPresenilin-1(Homo sapiens (Human))
Temple University School Of Pharmacy
Curated by ChEMBL
LigandPNGBDBM50521241(CHEMBL4456936)
Affinity DataEC50:  0.00920nM. Assay description: Inhibition of gamma-secretase (unknown origin) assessed as decrease in amyloid beta-42 secretion by cell based AlphaLisa assay
Ligand InfoPC cidPC sid
In DepthDetails ArticlePubMed