BDBM50521582 CHEMBL4543884
SMILES Fc1cc2[C@H](CCOc2cc1S(=O)(=O)Nc1ccncn1)N1CC[C@@H](C[C@@H]1c1cn[nH]c1)C(F)(F)F
InChI Key InChIKey=GZWFWMDJUPEGQW-JCGIZDLHSA-N
Data  1 KI
  Tab Delimited (TSV)   2D SDfile   Computed 3D by Vconf -m prep SDfile
Find this compound or compounds like it in BindingDB:
Activity Spreadsheet -- Enzyme Inhibition Constant Data from BindingDB
Found 1 hit for monomerid = 50521582
TargetSodium channel protein type 9 subunit alpha(Homo sapiens (Human))
Genentech
Curated by ChEMBL
LigandPNGBDBM50521582(CHEMBL4543884)
Affinity DataKi:  0.510nM. Assay description: Displacement of [3H]GX-545 from full length human Nav1.7 VSD4 domain expressed in HEK cell membranes measured after 20 hrs by liquid scintillation co...
Ligand InfoPC cidPC sid
In DepthDetails ArticlePubMed