BDBM50521655 CHEMBL4520561
SMILES CC[C@H](C)[C@H](NC(=O)[C@H](CC(N)=O)NC(=O)[C@@H](NC(=O)[C@H](Cc1cnc[nH]1)NC(=O)[C@H](CCCNC(N)=N)NC(=O)[C@@H](NC(=O)[C@H](CCCCN)NC(=O)[C@H](CCCNC(N)=N)NC(=O)[C@H](CC(C)C)NC(=O)[C@@H](N)C(C)C)[C@@H](C)O)C(C)C)C(=O)N[C@@H](CC(C)C)C(=O)N[C@@H](CC(C)C)C(=O)N[C@@H](Cc1ccccc1)C(=O)N[C@@H](CCSC)C(=O)NCC(N)=O
InChI Key InChIKey=KMSKZWFBMQJBJO-VKXFQFOCSA-N
Data  1 Kd
  Tab Delimited (TSV)   2D SDfile   Computed 3D by Vconf -m prep SDfile
Find this compound or compounds like it in BindingDB:
Activity Spreadsheet -- Enzyme Inhibition Constant Data from BindingDB
Found 1 hit for monomerid = 50521655
TargetSerine/threonine-protein kinase B-raf(Homo sapiens (Human))
University Of South Carolina
Curated by ChEMBL
LigandPNGBDBM50521655(CHEMBL4520561)
Affinity DataKd:  480nM. Assay description: Binding affinity to BRAF (unknown origin) by intrinsic tryptophan fluorescence assay
Ligand InfoPC cidPC sid
In DepthDetails ArticlePubMed