BDBM50521663 CHEMBL4443180
SMILES CSCC[C@@H]1NC(=O)[C@H](Cc2ccccc2)NC(=O)[C@H](CC(C)C)NC(=O)[C@H](CC(C)C)NC(=O)[C@H](CCC(O)=O)NC(=O)[C@H](C)NC(=O)[C@@H](NC(=O)[C@H](Cc2cnc[nH]2)NC(=O)[C@H](CCCNC(N)=N)NC(=O)[C@H](CCCCN)NC(=O)[C@H](CCCCN)NC(=O)[C@H](CCCNC(N)=N)NC(=O)[C@H](CC(C)C)NC(=O)CNC1=O)C(C)C
InChI Key InChIKey=YWTDUSDMMDQMFK-DCTVGVKOSA-N
Data  1 Kd
  Tab Delimited (TSV)   2D SDfile   Computed 3D by Vconf -m prep SDfile
Find this compound or compounds like it in BindingDB:
Activity Spreadsheet -- Enzyme Inhibition Constant Data from BindingDB
Found 1 hit for monomerid = 50521663
TargetSerine/threonine-protein kinase B-raf(Homo sapiens (Human))
University Of South Carolina
Curated by ChEMBL
LigandPNGBDBM50521663(CHEMBL4443180)
Affinity DataKd:  61nM. Assay description: Binding affinity to BRAF (unknown origin) by intrinsic tryptophan fluorescence assay
Ligand InfoPC cidPC sid
In DepthDetails ArticlePubMed