BDBM50522068 CHEMBL4441214
SMILES CN(CC#C)Cc1ccc(cc1)C(C)=O
InChI Key InChIKey=XUBSTAPWJFZBJZ-UHFFFAOYSA-N
Data  1 IC50
  Tab Delimited (TSV)   2D SDfile   Computed 3D by Vconf -m prep SDfile
Find this compound or compounds like it in BindingDB:
Activity Spreadsheet -- Enzyme Inhibition Constant Data from BindingDB
Found 1 hit for monomerid = 50522068
TargetPyrroline-5-carboxylate reductase 1, mitochondrial(Homo sapiens)
University Of Strathclyde
Curated by ChEMBL
LigandPNGBDBM50522068(CHEMBL4441214)
Affinity DataIC50:  1.84E+5nM. Assay description: Inhibition of 6x-His-tagged and SUMO tagged human PYCR1 expressed in Escherichia coli BL21 (DE3) cells assessed as reduction in NADH oxidation incuba...
Ligand InfoPC cidPC sid
In DepthDetails ArticlePubMed