BDBM50522442 CHEMBL383306
SMILES Oc1cc(cc(O)c1O)C(=O)OC[C@H]1O[C@H](OC(=O)c2cc(O)c(O)c(O)c2)[C@@H](OC(=O)c2cc(O)c(O)c(O)c2)[C@@H](OC(=O)c2cc(O)c(O)c(O)c2)[C@@H]1OC(=O)c1cc(O)c(O)c(O)c1
InChI Key InChIKey=QJYNZEYHSMRWBK-HIGXSMTHSA-N
Data  1 IC50
  Tab Delimited (TSV)   2D SDfile   Computed 3D by Vconf -m prep SDfile
Find this compound or compounds like it in BindingDB:
Activity Spreadsheet -- Enzyme Inhibition Constant Data from BindingDB
Found 1 hit for monomerid = 50522442
TargetAnthrax toxin receptor 2(Homo sapiens)
Instituto De Qu£Mica M£Dica (Iqm)
Curated by ChEMBL
LigandPNGBDBM50522442(CHEMBL383306)
Affinity DataIC50:  100nM. Assay description: Inhibition of AF488-labelled PA binding to AF546- labelled GST-tagged CMG2 R40C/C178A double mutant (unknown origin) expressed in Escherichia coli BL...
In DepthDetails ArticlePubMed