BDBM50522705 CHEMBL4471941
SMILES CC(C)CC(c1ccc(cc1)C(=O)NCCC(O)=O)n1ncc2cc(ccc12)-c1ccc(cc1)C(F)(F)F
InChI Key InChIKey=YGDFRPOOGOLAKC-UHFFFAOYSA-N
Data  2 KI
  Tab Delimited (TSV)   2D SDfile   Computed 3D by Vconf -m prep SDfile
Find this compound or compounds like it in BindingDB:
Activity Spreadsheet -- Enzyme Inhibition Constant Data from BindingDB
Found 2 hits for monomerid = 50522705
TargetGlucagon receptor(Homo sapiens (Human))
Janssen Research & Development
Curated by ChEMBL
LigandPNGBDBM50522705(CHEMBL4471941)
Affinity DataKi:  125nM. Assay description: Inhibition of human full length GCGR transfected in HEK293 cells assessed as reduction in glucagon-induced cAMP response by LANCE TR-FRET assay
Ligand InfoPC cidPC sid
In DepthDetails ArticlePubMed
TargetGlucagon receptor(Homo sapiens (Human))
Janssen Research & Development
Curated by ChEMBL
LigandPNGBDBM50522705(CHEMBL4471941)
Affinity DataKi:  260nM. Assay description: Antagonist activity at full length human recombinant GCGR transfected in HEK293 cells assessed as inhibition of glucagon-stimulated cAMP by by LANCE ...
Ligand InfoPC cidPC sid
In DepthDetails ArticlePubMed