BDBM50522738 CHEMBL4576987
SMILES CC(C)CC(c1ccc(cc1)C(=O)NCCC(O)=O)n1ccc2cc(ccc12)-c1ccc(cc1)C(F)(F)F
InChI Key InChIKey=SLXXPMFTKQTDLJ-UHFFFAOYSA-N
Data  1 KI
  Tab Delimited (TSV)   2D SDfile   Computed 3D by Vconf -m prep SDfile
Find this compound or compounds like it in BindingDB:
Activity Spreadsheet -- Enzyme Inhibition Constant Data from BindingDB
Found 1 hit for monomerid = 50522738
TargetGlucagon receptor(Homo sapiens (Human))
Janssen Research & Development
Curated by ChEMBL
LigandPNGBDBM50522738(CHEMBL4576987)
Affinity DataKi:  115nM. Assay description: Antagonist activity at full length human recombinant GCGR transfected in HEK293 cells assessed as inhibition of glucagon-stimulated cAMP by by LANCE ...
Ligand InfoPC cidPC sid
In DepthDetails ArticlePubMed