BDBM50523029 CHEMBL4450117
SMILES C[C@@H](O[C@H]1CC[C@]2(CC(F)(F)CO2)CC1)c1nc(no1)-c1cc(F)c(CS(C)(=O)=O)c(F)c1
InChI Key InChIKey=IZJFKBJSGCVADR-ZGLRSVDFSA-N
Data  1 EC50
  Tab Delimited (TSV)   2D SDfile   Computed 3D by Vconf -m prep SDfile
Find this compound or compounds like it in BindingDB:
Activity Spreadsheet -- Enzyme Inhibition Constant Data from BindingDB
Found 1 hit for monomerid = 50523029
TargetGlucose-dependent insulinotropic receptor(Homo sapiens (Human))
Japan Tobacco
Curated by ChEMBL
LigandPNGBDBM50523029(CHEMBL4450117)
Affinity DataEC50:  7nM. Assay description: Agonist activity at recombinant human GPR119 expressed in HEK293 cells assessed as increase in intracellular cAMP accumulation measured after 30 mins
Ligand InfoPC cidPC sid
In DepthDetails ArticlePubMed