BDBM50524067 CHEMBL4514865
SMILES C[C@@H]1C(=O)N\C(=C/c2ccccc2)c2nc3c(O)cccc3c(=O)n12
InChI Key InChIKey=JKOZPSNPSQBQCF-UXEDPAHQSA-N
Data  6 IC50  1 EC50
  Tab Delimited (TSV)   2D SDfile   Computed 3D by Vconf -m prep SDfile
Find this compound or compounds like it in BindingDB:
Activity Spreadsheet -- Enzyme Inhibition Constant Data from BindingDB
Found 7 hits for monomerid = 50524067
TargetTyrosine-protein phosphatase non-receptor type 11(Homo sapiens (Human))
Chinese Academy Of Sciences
Curated by ChEMBL
LigandPNGBDBM50524067(CHEMBL4514865)
Affinity DataIC50:  1.40E+4nM. Assay description: Inhibition of recombinant human SHP2 expressed in Escherichia coli using pNPP as substrate preincubated for 15 mins followed by substrate addition an...
Ligand InfoPC cidPC sid
In DepthDetails ArticlePubMed
TargetTyrosine-protein phosphatase non-receptor type 2(Homo sapiens (Human))
Chinese Academy Of Sciences
Curated by ChEMBL
LigandPNGBDBM50524067(CHEMBL4514865)
Affinity DataIC50:  1.40E+4nM. Assay description: Inhibition of recombinant human TCPTP expressed in Escherichia coli using pNPP as substrate preincubated for 15 mins followed by substrate addition a...
Ligand InfoPC cidPC sid
In DepthDetails ArticlePubMed
TargetTyrosine-protein phosphatase non-receptor type 6(Homo sapiens (Human))
Chinese Academy Of Sciences
Curated by ChEMBL
LigandPNGBDBM50524067(CHEMBL4514865)
Affinity DataIC50:  1.40E+4nM. Assay description: Inhibition of recombinant human SHP1 expressed in Escherichia coli using pNPP as substrate preincubated for 15 mins followed by substrate addition an...
Ligand InfoPC cidPC sid
In DepthDetails ArticlePubMed
TargetOxysterols receptor LXR-alpha(Homo sapiens (Human))
Chinese Academy Of Sciences
Curated by ChEMBL
LigandPNGBDBM50524067(CHEMBL4514865)
Affinity DataEC50:  1.70E+3nM. Assay description: Transactivation of recombinant GAL4-fused human LXRalpha LBD (163 to 447 residues) expressed in human L02 cells measured after 24 hrs by luciferase r...
Ligand InfoPC cidPC sid
In DepthDetails ArticlePubMed
TargetTyrosine-protein phosphatase non-receptor type 1(Homo sapiens (Human))
Chinese Academy Of Sciences
Curated by ChEMBL
LigandPNGBDBM50524067(CHEMBL4514865)
Affinity DataIC50:  1.40E+4nM. Assay description: Inhibition of recombinant human PTP1B expressed in Escherichia coli using pNPP as substrate preincubated for 15 mins followed by substrate addition a...
Ligand InfoPC cidPC sid
In DepthDetails ArticlePubMed
TargetIndoleamine 2,3-dioxygenase 1(Homo sapiens (Human))
Chinese Academy Of Sciences
Curated by ChEMBL
LigandPNGBDBM50524067(CHEMBL4514865)
Affinity DataIC50:  1.40E+4nM. Assay description: Inhibition of recombinant human IDO1 expressed in Escherichia coli using pNPP as substrate preincubated for 15 mins followed by substrate addition an...
Ligand InfoPC cidPC sid
In DepthDetails ArticlePubMed
TargetTyrosine-protein phosphatase non-receptor type 9(Homo sapiens (Human))
Chinese Academy Of Sciences
Curated by ChEMBL
LigandPNGBDBM50524067(CHEMBL4514865)
Affinity DataIC50:  1.40E+4nM. Assay description: Inhibition of recombinant human MEG2 expressed in Escherichia coli using pNPP as substrate preincubated for 15 mins followed by substrate addition an...
Ligand InfoPC cidPC sid
In DepthDetails ArticlePubMed