BDBM50524361 CHEMBL4451258
SMILES CC(C)C[C@H](N)C(=O)NS(=O)(=O)OC[C@H]1O[C@H]([C@H](O)[C@@H]1O)n1ccc(=O)n(C)c1=O
InChI Key InChIKey=IHQCOGYAMSEDBL-KHBBOIOASA-N
Data  1 KI
PDB links: 1 PDB ID matches this monomer.
  Tab Delimited (TSV)   2D SDfile   Computed 3D by Vconf -m prep SDfile
Find this compound or compounds like it in BindingDB:
Activity Spreadsheet -- Enzyme Inhibition Constant Data from BindingDB
Found 1 hit for monomerid = 50524361
TargetLeucine--tRNA ligase(Escherichia coli (strain K12))
Ku Leuven
Curated by ChEMBL
LigandPNGBDBM50524361(CHEMBL4451258)
Affinity DataKi:  30nM. Assay description: Inhibition of purified Escherichia coli BL21 (DE3) leuRS incubated for 10 mins in presence of 14C-labeled leucine by radiolabel transfer assay
Ligand InfoPC cidPC sidPDB
In DepthDetails ArticlePubMed