BDBM50525257 CHEMBL4520995
SMILES [O-][N+](=O)c1ccc(cc1)N(Cc1ccc(Br)cc1)n1cnnc1
InChI Key InChIKey=KRJKUEKJJRPEPV-UHFFFAOYSA-N
Data  1 IC50
  Tab Delimited (TSV)   2D SDfile   Computed 3D by Vconf -m prep SDfile
Find this compound or compounds like it in BindingDB:
Activity Spreadsheet -- Enzyme Inhibition Constant Data from BindingDB
Found 1 hit for monomerid = 50525257
TargetAromatase(Homo sapiens (Human))
Indian Institute Of Technology (Bhu)
Curated by ChEMBL
LigandPNGBDBM50525257(CHEMBL4520995)
Affinity DataIC50:  0.120nM. Assay description: Inhibition of human placental microsome aromatase using [1beta,2beta3H]androstenedione as substrate by liquid scintillation counting method
Ligand InfoPC cidPC sid
In DepthDetails ArticlePubMed