BDBM50525523 CHEMBL4449508
SMILES FC(F)(F)c1ccc(CO\N=C\c2c(nc3occn23)-c2ccc3ccccc3c2)cc1
InChI Key InChIKey=YNPJUDOGHKZVIK-CCVNUDIWSA-N
Data  2 EC50
  Tab Delimited (TSV)   2D SDfile   Computed 3D by Vconf -m prep SDfile
Find this compound or compounds like it in BindingDB:
Activity Spreadsheet -- Enzyme Inhibition Constant Data from BindingDB
Found 2 hits for monomerid = 50525523
TargetNuclear receptor subfamily 1 group I member 3(Homo sapiens (Human))
University Of Maryland
Curated by ChEMBL
LigandPNGBDBM50525523(CHEMBL4449508)
Affinity DataEC50:  470nM. Assay description: Agonist activity at human CAR transfected in human HepG2 cells cotransfected with CYP2B6 incubated for 23 hrs by luciferase reported gene assay
Ligand InfoPC cidPC sid
In DepthDetails ArticlePubMed
TargetNuclear receptor subfamily 1 group I member 2(Homo sapiens (Human))
University Of Maryland
Curated by ChEMBL
LigandPNGBDBM50525523(CHEMBL4449508)
Affinity DataEC50:  2.00E+3nM. Assay description: Agonist activity at human PXR transfected in human HepG2 cells cotransfected with CYP3A4 incubated for 23 hrs by luciferase reporter gene assay
Ligand InfoPC cidPC sid
In DepthDetails ArticlePubMed