BDBM50526114 CHEMBL4529442
SMILES C=CC(=O)N(CC(=O)NC1COC1)c1nc(cs1)-c1ccccc1
InChI Key InChIKey=CAPZUKVRQPOFQF-UHFFFAOYSA-N
Data  1 IC50
  Tab Delimited (TSV)   2D SDfile   Computed 3D by Vconf -m prep SDfile
Find this compound or compounds like it in BindingDB:
Activity Spreadsheet -- Enzyme Inhibition Constant Data from BindingDB
Found 1 hit for monomerid = 50526114
TargetGlutathione S-transferase omega-1(Homo sapiens (Human))
Sichuan University
Curated by ChEMBL
LigandPNGBDBM50526114(CHEMBL4529442)
Affinity DataIC50:  30nM. Assay description: Inhibition of CMFDA binding to human N-terminal 6x-His-tagged GSTO1-1 preincubated for 30 mins followed by CMFDA addition and measured after 30 mins ...
Ligand InfoPC cidPC sid
In DepthDetails ArticlePubMed