BDBM50526117 CHEMBL4568270
SMILES Cc1cc(CN(C(=O)C=C)c2nc(cs2)-c2ccc(F)cc2O)on1
InChI Key InChIKey=KXBRSXLOEIFLBR-UHFFFAOYSA-N
Data  1 IC50
  Tab Delimited (TSV)   2D SDfile   Computed 3D by Vconf -m prep SDfile
Find this compound or compounds like it in BindingDB:
Activity Spreadsheet -- Enzyme Inhibition Constant Data from BindingDB
Found 1 hit for monomerid = 50526117
TargetGlutathione S-transferase omega-1(Homo sapiens (Human))
Sichuan University
Curated by ChEMBL
LigandPNGBDBM50526117(CHEMBL4568270)
Affinity DataIC50:  40nM. Assay description: Inhibition of CMFDA binding to human N-terminal 6x-His-tagged GSTO1-1 preincubated for 30 mins followed by CMFDA addition and measured after 30 mins ...
Ligand InfoPC cidPC sid
In DepthDetails ArticlePubMed