BDBM50526131 CHEMBL4455136
SMILES C=CC(=O)N(CC(=O)NCCN1CCOCC1)c1nc(cs1)-c1ccccc1
InChI Key InChIKey=YVTSIDYTFLVMGU-UHFFFAOYSA-N
Data  1 IC50
  Tab Delimited (TSV)   2D SDfile   Computed 3D by Vconf -m prep SDfile
Find this compound or compounds like it in BindingDB:
Activity Spreadsheet -- Enzyme Inhibition Constant Data from BindingDB
Found 1 hit for monomerid = 50526131
TargetGlutathione S-transferase omega-1(Homo sapiens (Human))
Sichuan University
Curated by ChEMBL
LigandPNGBDBM50526131(CHEMBL4455136)
Affinity DataIC50:  230nM. Assay description: Inhibition of CMFDA binding to human N-terminal 6x-His-tagged GSTO1-1 preincubated for 30 mins followed by CMFDA addition and measured after 30 mins ...
Ligand InfoPC cidPC sid
In DepthDetails ArticlePubMed