BDBM50526152 CHEMBL4454963
SMILES Cc1cc(CN(C(=O)C=C)c2nc(cs2)-c2ccccc2)on1
InChI Key InChIKey=QTXKMZWSNNBMRC-UHFFFAOYSA-N
Data  1 IC50
  Tab Delimited (TSV)   2D SDfile   Computed 3D by Vconf -m prep SDfile
Find this compound or compounds like it in BindingDB:
Activity Spreadsheet -- Enzyme Inhibition Constant Data from BindingDB
Found 1 hit for monomerid = 50526152
TargetGlutathione S-transferase omega-1(Homo sapiens (Human))
Sichuan University
Curated by ChEMBL
LigandPNGBDBM50526152(CHEMBL4454963)
Affinity DataIC50:  51nM. Assay description: Inhibition of CMFDA binding to human N-terminal 6x-His-tagged GSTO1-1 preincubated for 30 mins followed by CMFDA addition and measured after 30 mins ...
Ligand InfoPC cidPC sid
In DepthDetails ArticlePubMed