BDBM50526643 CHEMBL4475677
SMILES [H][C@@]1(O[C@H]([C@@]2([H])O[C@H]([C@H](O)[C@@H]2O)n2ccc(=O)[nH]c2=O)[C@]2([H])NC[C@@H](CCCCCCCCCCCCCCCCC)[C@H](N(C)C2=O)C(O)=O)O[C@H](CN)[C@@H](O)[C@H]1O
InChI Key InChIKey=KIJIAZHWTIZXMV-BRLZVDOZSA-N
Data  1 IC50
  Tab Delimited (TSV)   2D SDfile   Computed 3D by Vconf -m prep SDfile
Find this compound or compounds like it in BindingDB:
Activity Spreadsheet -- Enzyme Inhibition Constant Data from BindingDB
Found 1 hit for monomerid = 50526643
TargetPhospho-N-acetylmuramoyl-pentapeptide-transferase(Staphylococcus aureus (strain MRSA252))
Griffith University
Curated by ChEMBL
LigandPNGBDBM50526643(CHEMBL4475677)
Affinity DataIC50:  2.60nM. Assay description: Inhibition of MraY in Staphylococcus aureus
Ligand InfoPC cidPC sid
In DepthDetails ArticlePubMed