BDBM50527180 CHEMBL4588856
SMILES CN(C)S(=O)(=O)c1cc(NC(=O)CCl)ccc1I
InChI Key InChIKey=UHTJVXMVCVDKDI-UHFFFAOYSA-N
Data  1 IC50
  Tab Delimited (TSV)   2D SDfile   Computed 3D by Vconf -m prep SDfile
Find this compound or compounds like it in BindingDB:
Activity Spreadsheet -- Enzyme Inhibition Constant Data from BindingDB
Found 1 hit for monomerid = 50527180
TargetGlutathione S-transferase omega-1(Homo sapiens (Human))
Monash University
Curated by ChEMBL
LigandPNGBDBM50527180(CHEMBL4588856)
Affinity DataIC50:  130nM. Assay description: Inhibition of recombinant GSTO1-1 (unknown origin) expressed in Escherichia coli using S-(4-nitrophenacyl)glutathione as substrate preincubated for 2...
Ligand InfoPC cidPC sid
In DepthDetails ArticlePubMed