BDBM50527462 CHEMBL4452922
SMILES CC(C)CC1C(C(=O)Nc2ccccc2Cl)=C(C)NC2=C1C(=O)CCC2
InChI Key InChIKey=BUOFNCUBSXQLEX-UHFFFAOYSA-N
Data  2 EC50
  Tab Delimited (TSV)   2D SDfile   Computed 3D by Vconf -m prep SDfile
Find this compound or compounds like it in BindingDB:
Activity Spreadsheet -- Enzyme Inhibition Constant Data from BindingDB
Found 2 hits for monomerid = 50527462
TargetFree fatty acid receptor 3(Homo sapiens (Human))
University Of Copenhagen
Curated by ChEMBL
LigandPNGBDBM50527462(CHEMBL4452922)
Affinity DataEC50:  708nM. Assay description: Agonist activity at human FFA3 receptor stably expressed in Flp-In T-Rex HEK293 cells cotransfected with eYFP assessed as inhibition of forskolin-ind...
Ligand InfoPC cidPC sid
In DepthDetails ArticlePubMed
TargetFree fatty acid receptor 3(Homo sapiens (Human))
University Of Copenhagen
Curated by ChEMBL
LigandPNGBDBM50527462(CHEMBL4452922)
Affinity DataEC50:  3.89E+3nM. Assay description: Agonist activity at human FFA3 receptor stably expressed in Flp-In T-Rex HEK293 cell membrane assessed as stimulation of [35S]-GTPgammaS binding meas...
Ligand InfoPC cidPC sid
In DepthDetails ArticlePubMed