BDBM50527470 CHEMBL4578663
SMILES CC1=C(C(C2=C(CCCC2=O)N1)c1ccccc1)C(=O)Nc1ccccc1C
InChI Key InChIKey=JNHQFAUXLXICSB-UHFFFAOYSA-N
Data  2 EC50
  Tab Delimited (TSV)   2D SDfile   Computed 3D by Vconf -m prep SDfile
Find this compound or compounds like it in BindingDB:
Activity Spreadsheet -- Enzyme Inhibition Constant Data from BindingDB
Found 2 hits for monomerid = 50527470
TargetFree fatty acid receptor 3(Homo sapiens (Human))
University Of Copenhagen
Curated by ChEMBL
LigandPNGBDBM50527470(CHEMBL4578663)
Affinity DataEC50:  1.23E+3nM. Assay description: Agonist activity at human FFA3 receptor stably expressed in Flp-In T-Rex HEK293 cells cotransfected with eYFP assessed as inhibition of forskolin-ind...
Ligand InfoPC cidPC sid
In DepthDetails ArticlePubMed
TargetFree fatty acid receptor 3(Homo sapiens (Human))
University Of Copenhagen
Curated by ChEMBL
LigandPNGBDBM50527470(CHEMBL4578663)
Affinity DataEC50:  1.78E+4nM. Assay description: Agonist activity at human FFA3 receptor stably expressed in Flp-In T-Rex HEK293 cell membrane assessed as stimulation of [35S]-GTPgammaS binding meas...
Ligand InfoPC cidPC sid
In DepthDetails ArticlePubMed