BDBM50527502 CHEMBL4515057
SMILES COC(=O)C1=C(C)NC(C)=C(C1CC(C)C)C(=O)Nc1ccccc1C
InChI Key InChIKey=WTFDRRPGQNVNFT-UHFFFAOYSA-N
Data  1 EC50
  Tab Delimited (TSV)   2D SDfile   Computed 3D by Vconf -m prep SDfile
Find this compound or compounds like it in BindingDB:
Activity Spreadsheet -- Enzyme Inhibition Constant Data from BindingDB
Found 1 hit for monomerid = 50527502
TargetFree fatty acid receptor 3(Homo sapiens (Human))
University Of Copenhagen
Curated by ChEMBL
LigandPNGBDBM50527502(CHEMBL4515057)
Affinity DataEC50:  692nM. Assay description: Positive allosteric modulation at human FFA3 receptor stably expressed in Flp-In T-Rex HEK293 cells cotransfected with eYFP assessed as inhibition of...
Ligand InfoPC cidPC sid
In DepthDetails ArticlePubMed