BDBM50527506 CHEMBL4579352
SMILES CC1=C(C(c2cscn2)C2=C(CCCC2=O)N1)C(=O)Nc1cc(Cl)ccc1Cl
InChI Key InChIKey=LMNCYVRGOIDEGB-UHFFFAOYSA-N
Data  1 EC50
  Tab Delimited (TSV)   2D SDfile   Computed 3D by Vconf -m prep SDfile
Find this compound or compounds like it in BindingDB:
Activity Spreadsheet -- Enzyme Inhibition Constant Data from BindingDB
Found 1 hit for monomerid = 50527506
TargetFree fatty acid receptor 3(Homo sapiens (Human))
University Of Copenhagen
Curated by ChEMBL
LigandPNGBDBM50527506(CHEMBL4579352)
Affinity DataEC50:  1.95E+3nM. Assay description: Agonist activity at human FFA3 receptor stably expressed in Flp-In T-Rex HEK293 cells cotransfected with eYFP assessed as inhibition of forskolin-ind...
Ligand InfoPC cidPC sid
In DepthDetails ArticlePubMed