BDBM50528950 CHEMBL4454174
SMILES NC(=O)c1ccc(C(O)=O)c(NC(=O)c2ccc(Cc3c[nH]c4nc(N)[nH]c(=O)c34)cc2)c1
InChI Key InChIKey=ZFQOKUXSWWJOFS-UHFFFAOYSA-N
Data  2 IC50
PDB links: 1 PDB ID matches this monomer.
  Tab Delimited (TSV)   2D SDfile   Computed 3D by Vconf -m prep SDfile
Find this compound or compounds like it in BindingDB:
Activity Spreadsheet -- Enzyme Inhibition Constant Data from BindingDB
Found 2 hits for monomerid = 50528950
TargetBifunctional dihydrofolate reductase-thymidylate synthase(Cryptosporidium hominis)
Yale University
Curated by ChEMBL
LigandPNGBDBM50528950(CHEMBL4454174)
Affinity DataIC50:  2.00E+4nM. Assay description: Inhibition of recombinant Cryptosporidium hominis TS-DHFR expresssed in Escherichia coli PA414 using dUMP and 5,10-methylenetetrahydrofolate as subst...
Ligand InfoPC cidPC sidPDB
TargetPolyunsaturated fatty acid lipoxygenase ALOX15B(Rattus norvegicus)
Yale University
Curated by ChEMBL
LigandPNGBDBM50528950(CHEMBL4454174)
Affinity DataIC50:  1.00E+3nM. Assay description: Inhibition of recombinant human His6-tagged TS using dUMP and 5,10-methylenetetrahydrofolate as substrate by spectrometry
Ligand InfoPC cidPC sidPDB
In DepthDetails ArticlePubMed