BDBM50529511 CHEMBL4519976
SMILES [H][C@]12CC[C@]([H])(C[C@@H](C1)c1cccc(c1)C(N)=O)N2CCCCCN(CC(CC)CC)C(=O)CO
InChI Key InChIKey=BAJJIHKMLNYVEG-QEIWAGNOSA-N
Data  2 KI
  Tab Delimited (TSV)   2D SDfile   Computed 3D by Vconf -m prep SDfile
Find this compound or compounds like it in BindingDB:
Activity Spreadsheet -- Enzyme Inhibition Constant Data from BindingDB
Found 2 hits for monomerid = 50529511
TargetMu-type opioid receptor(Homo sapiens (Human))
Theravance Biopharma Us
Curated by ChEMBL
LigandPNGBDBM50529511(CHEMBL4519976)
Affinity DataKi:  0.631nM. Assay description: Displacement of [3H]-DPN from recombinant human mu opioid receptor expressed in CHO-K1 cell membranes by radioligand binding assay
Ligand InfoPC cidPC sid
In DepthDetails ArticlePubMed
TargetDelta-type opioid receptor(Homo sapiens (Human))
Theravance Biopharma Us
Curated by ChEMBL
LigandPNGBDBM50529511(CHEMBL4519976)
Affinity DataKi:  20nM. Assay description: Displacement of [3H]-DPN from recombinant human delta opioid receptor expressed in CHO-K1 cell membranes by radioligand binding assay
Ligand InfoPC cidPC sid
In DepthDetails ArticlePubMed