BDBM50529605 CHEMBL4569028
SMILES [H][C@]12C=C[C@H](O)[C@@H](O)[C@]1([H])C(=O)c1c(O)cc(C)cc1[C@@H]2O
InChI Key InChIKey=DCWFHKXKKWCTRD-RKLKDSAASA-N
Data  2 IC50
  Tab Delimited (TSV)   2D SDfile   Computed 3D by Vconf -m prep SDfile
Find this compound or compounds like it in BindingDB:
Activity Spreadsheet -- Enzyme Inhibition Constant Data from BindingDB
Found 2 hits for monomerid = 50529605
TargetDNA topoisomerase I(Bos taurus)
Beijing Normal University
Curated by ChEMBL
LigandPNGBDBM50529605(CHEMBL4569028)
Affinity DataIC50:  2.30E+4nM. Assay description: Inhibition of calf thymus DNA topoisomerase 1 assessed as decrease in relaxation of supercoiled pBR322 DNA after 30 mins by Genview nucleic acid stai...
Ligand InfoPC cidPC sid
In DepthDetails ArticlePubMed
TargetDNA topoisomerase I(Bos taurus)
Beijing Normal University
Curated by ChEMBL
LigandPNGBDBM50529605(CHEMBL4569028)
Affinity DataIC50:  2.30E+4nM. Assay description: Inhibition of calf thymus DNA topoisomerase 1 assessed as decrease in relaxation of supercoiled pBR322 DNA after 30 mins by Genview nucleic acid stai...
Ligand InfoPC cidPC sid
In DepthDetails ArticlePubMed