BDBM50529615 CHEMBL4445892
SMILES [H][C@]12CC[C@]([H])(CN(C1)c1nc(Nc3cnc(C(=O)NCC)c(C)c3)ncc1F)N2C(=O)C1CC1
InChI Key InChIKey=ZXBVETHTIGOXIX-CALCHBBNSA-N
Data  12 IC50
  Tab Delimited (TSV)   2D SDfile   Computed 3D by Vconf -m prep SDfile
Find this compound or compounds like it in BindingDB:
Activity Spreadsheet -- Enzyme Inhibition Constant Data from BindingDB
Found 12 hits for monomerid = 50529615
TargetNon-receptor tyrosine-protein kinase TYK2(Homo sapiens (Human))
Pfizer
Curated by ChEMBL
LigandPNGBDBM50529615(CHEMBL4445892)
Affinity DataIC50:  48nM. Assay description: Inhibition of human TYK2 using fluorescence labeled peptide as substrate and using 1 mM ATP level by microfluidic based mobility shift assay
Ligand InfoPC cidPC sid
In DepthDetails ArticlePubMed
TargetTyrosine-protein kinase JAK2(Homo sapiens (Human))
Pfizer
Curated by ChEMBL
LigandPNGBDBM50529615(CHEMBL4445892)
Affinity DataIC50:  1.22E+4nM. Assay description: Inhibition of JAK2 homodimer signaling pathway in human spiked CD34 +ve cells of whole blood assessed as reduction in EPO induced STAT5 phosphorylati...
Ligand InfoPC cidPC sid
In DepthDetails ArticlePubMed
TargetNon-receptor tyrosine-protein kinase TYK2(Homo sapiens (Human))
Pfizer
Curated by ChEMBL
LigandPNGBDBM50529615(CHEMBL4445892)
Affinity DataIC50:  48nM. Assay description: Inhibition of human TYK2 using fluorescence labeled peptide as substrate and using 1 mM ATP level by microfluidic based mobility shift assay
Ligand InfoPC cidPC sid
In DepthDetails ArticlePubMed
TargetTyrosine-protein kinase JAK1(Homo sapiens (Human))
Pfizer
Curated by ChEMBL
LigandPNGBDBM50529615(CHEMBL4445892)
Affinity DataIC50:  234nM. Assay description: Inhibition of human JAK1 using fluorescence labeled peptide as substrate and using 1 mM ATP by microfluidic based mobility shift assay
Ligand InfoPC cidPC sid
In DepthDetails ArticlePubMed
TargetTyrosine-protein kinase JAK2(Homo sapiens (Human))
Pfizer
Curated by ChEMBL
LigandPNGBDBM50529615(CHEMBL4445892)
Affinity DataIC50:  692nM. Assay description: Inhibition of human JAK2 using fluorescence labeled peptide as substrate and using 1 mM ATP by microfluidic based mobility shift assay
Ligand InfoPC cidPC sid
In DepthDetails ArticlePubMed
LigandPNGBDBM50529615(CHEMBL4445892)
Affinity DataIC50:  385nM. Assay description: Inhibition of JAK1/TYK2 signaling pathway in human lymphocytes of whole blood assessed as reduction in IFN-alpha induced STAT3 phosphorylation preinc...
Ligand InfoPC cidPC sid
In DepthDetails ArticlePubMed
TargetTyrosine-protein kinase JAK1(Homo sapiens (Human))
Pfizer
Curated by ChEMBL
LigandPNGBDBM50529615(CHEMBL4445892)
Affinity DataIC50:  234nM. Assay description: Inhibition of human JAK1 using fluorescence labeled peptide as substrate and using 1 mM ATP by microfluidic based mobility shift assay
Ligand InfoPC cidPC sid
In DepthDetails ArticlePubMed
TargetTyrosine-protein kinase JAK3(Homo sapiens (Human))
Pfizer
Curated by ChEMBL
LigandPNGBDBM50529615(CHEMBL4445892)
Affinity DataIC50:  4.96E+3nM. Assay description: Inhibition of human JAK3 using fluorescence labeled peptide as substrate and using 1 mM ATP by microfluidic based mobility shift assay
Ligand InfoPC cidPC sid
In DepthDetails ArticlePubMed
TargetTyrosine-protein kinase JAK2(Homo sapiens (Human))
Pfizer
Curated by ChEMBL
LigandPNGBDBM50529615(CHEMBL4445892)
Affinity DataIC50:  692nM. Assay description: Inhibition of human JAK2 using fluorescence labeled peptide as substrate and using 1 mM ATP by microfluidic based mobility shift assay
Ligand InfoPC cidPC sid
In DepthDetails ArticlePubMed
TargetTyrosine-protein kinase JAK3(Homo sapiens (Human))
Pfizer
Curated by ChEMBL
LigandPNGBDBM50529615(CHEMBL4445892)
Affinity DataIC50:  4.96E+3nM. Assay description: Inhibition of human JAK3 using fluorescence labeled peptide as substrate and using 1 mM ATP by microfluidic based mobility shift assay
Ligand InfoPC cidPC sid
In DepthDetails ArticlePubMed
LigandPNGBDBM50529615(CHEMBL4445892)
Affinity DataIC50:  385nM. Assay description: Inhibition of JAK1/TYK2 signaling pathway in human lymphocytes of whole blood assessed as reduction in IFN-alpha induced STAT3 phosphorylation preinc...
Ligand InfoPC cidPC sid
In DepthDetails ArticlePubMed
TargetTyrosine-protein kinase JAK2(Homo sapiens (Human))
Pfizer
Curated by ChEMBL
LigandPNGBDBM50529615(CHEMBL4445892)
Affinity DataIC50:  1.22E+4nM. Assay description: Inhibition of JAK2 homodimer signaling pathway in human spiked CD34 +ve cells of whole blood assessed as reduction in EPO induced STAT5 phosphorylati...
Ligand InfoPC cidPC sid
In DepthDetails ArticlePubMed