BDBM50529634 CHEMBL4459542
SMILES [H][C@@]12[C@@H](CC[C@@]1(CC[C@]1(C)C2CC[C@]2([H])[C@@]3(C)CC=CC(C)(C)[C@]3([H])CC[C@@]12C)C(=O)NO)C(C)=C
InChI Key InChIKey=DFFZHMMRBSLZNT-JODHIMNBSA-N
Data  2 EC50
  Tab Delimited (TSV)   2D SDfile   Computed 3D by Vconf -m prep SDfile
Find this compound or compounds like it in BindingDB:
Activity Spreadsheet -- Enzyme Inhibition Constant Data from BindingDB
Found 2 hits for monomerid = 50529634
LigandPNGBDBM50529634(CHEMBL4459542)
Affinity DataEC50:  3.20E+3nM. Assay description: Inhibition of PHD (unknown origin) expressed in mouse NIH/3T3 cells harboring HRE-driven luciferase gene assessed as transactivation of HIF1alpha aft...
Ligand InfoPC cidPC sid
In DepthDetails ArticlePubMed
LigandPNGBDBM50529634(CHEMBL4459542)
Affinity DataEC50:  3.20E+3nM. Assay description: Inhibition of PHD (unknown origin) expressed in mouse NIH/3T3 cells harboring HRE-driven luciferase gene assessed as transactivation of HIF1alpha aft...
Ligand InfoPC cidPC sid
In DepthDetails ArticlePubMed